{"text_format":"3","workbook":"xlsx","n_sheets":5,"sheets":["Select","Inputs","NPAPRFX","SAEX","EXDA"],"not_rendered":{"images":2,"macros":1,"defined_names":19},"read":"whole","date_system":"1900"}

{"sheet":"Select","index":0,"n_rows":5,"n_cols":10,"rows_kept":5,"merged":[[1,3,1,7],[1,8,1,9]]}
[]
[{"$nulls":3},{"$f":"\"Exchange Name:  \"&ExchName","v":"Exchange Name:  "},{"$nulls":4},{"$f":"\"Exch Count:  \" & SUBTOTAL(2,I4:I1000)","v":"Exch Count:  0"}]
["Enter Exchange:",null,null,"Local Exchanges (Zone 1 and 2)",null,"Zone 3 Exchanges",null,null,"Area Code","Prefix"]
["Area Code:"]
["Prefix:"]

{"sheet":"Inputs","index":1,"n_rows":37,"n_cols":6,"rows_kept":37,"hidden":true}
[null,"AC",null,"RCC:",{"$f":"IF(AND(ENPA > 0, PRFX > 0),VLOOKUP(_xlfn.NUMBERVALUE(CONCATENATE(Select!B4,Select!B5)),NPAPRFX!A:B,2,FALSE),\"\")","v":""}]
[null,209,null,"EXCH Name:",{"$f":"IF(RCC <> \"\",VLOOKUP(RCC,EXDA!A:B,2,FALSE), \"\")","v":""},{"$f":"IF(ExchName <> \"\",VLOOKUP(RCC,EXDA!A:C,3,FALSE),\"\")","v":""}]
[null,213,null,"RCCStart:",{"$f":"IF(RCC <> \"\",MATCH(_xlfn.NUMBERVALUE(RCC),SAEX!A:A,0),0)","v":0}]
[null,310,null,"RCCEnd:",{"$f":"IF(RCC <> \"\",MATCH(_xlfn.NUMBERVALUE(RCC),SAEX!A:A,1),0)","v":0}]
[null,323,null,"CurrRCCRow:",1318]
[null,408,null,"Curr SvcRCC:",{"$f":"IF(CurrRCCRow <> \"\",INDIRECT(ADDRESS(CurrRCCRow,2,1,,\"SAEX\")),0)","v":209}]
[null,415,null,"Curr EXCH:",{"$f":"IF(CurrSvcRCC <> \"\",VLOOKUP(CurrSvcRCC,EXDA!A:B,2,FALSE), \"\")","v":"SOUTH SAN FRANCISCO"},{"$f":"IF(VLOOKUP(CurrSvcRCC,EXDA!A:C,3,FALSE)=0,\"\",VLOOKUP(CurrSvcRCC,EXDA!A:C,3,FALSE))","v":""}]
[null,424]
[null,442,null,"CurrExchRCC:",159]
[null,510,null,"ZUM2Indx:",{"$f":"SUM(SUBTOTAL(3,Select!D4:D1000),3)","v":3}]
[null,530,null,"ZUM3Indx:",{"$f":"SUM(SUBTOTAL(3,Select!F4:F1000),3)","v":3}]
[null,559,null,"NPARCCStart:",{"$f":"IF(CurrExchRCC <> \"\",MATCH(_xlfn.NUMBERVALUE(CurrExchRCC),NPAPRFX!B:B,0),0)","v":3390}]
[null,562,null,"NPARCCEnd:",{"$f":"IF(CurrExchRCC <> \"\",MATCH(_xlfn.NUMBERVALUE(CurrExchRCC),NPAPRFX!B:B,1),0)","v":3415}]
[null,619]
[null,626]
[null,628]
[null,650]
[null,657]
[null,661]
[null,669]
[null,702]
[null,707]
[null,714]
[null,725]
[null,747]
[null,760]
[null,775]
[null,805]
[null,818]
[null,831]
[null,858]
[null,909]
[null,916]
[null,925]
[null,928]
[null,949]
[null,951]

{"sheet":"NPAPRFX","index":2,"n_rows":20211,"n_cols":4,"rows_kept":20211,"hidden":true}
["NPAPrfx","RCC","NPA","PRFX"]
[559390,1,559,390]
[559588,1,559,588]
[559751,1,559,751]
[559949,1,559,949]
[209297,2,209,297]
[209559,2,209,559]
[209728,2,209,728]
[209729,2,209,729]
[209736,2,209,736]
[209743,2,209,743]
[209753,2,209,753]
[209795,2,209,795]
[209807,2,209,807]
[209813,2,209,813]
[209822,2,209,822]
[209890,2,209,890]
[209276,3,209,276]
[209326,3,209,326]
[209356,3,209,356]
[209357,3,209,357]
[209358,3,209,358]
[209445,3,209,445]
[209635,3,209,635]
[209643,3,209,643]
[209676,3,209,676]
[209683,3,209,683]
[209812,3,209,812]
[559855,4,559,855]
[559282,5,559,282]
[559328,5,559,328]
[559383,5,559,383]
[559386,5,559,386]
[559401,5,559,401]
[559717,5,559,717]
[559337,6,559,337]
[559398,6,559,398]
[559677,6,559,677]
[559893,7,559,893]
[559384,8,559,384]
[559402,8,559,402]
[559482,8,559,482]
[559520,8,559,520]
[559866,8,559,866]
[559884,8,559,884]
[559895,8,559,895]
[559234,9,559,234]
[559403,9,559,403]
[559644,9,559,644]
[559682,9,559,682]
[559864,9,559,864]
[559885,9,559,885]
[559942,9,559,942]
[209374,10,209,374]
[559201,11,559,201]
[559223,11,559,223]
[559508,11,559,508]
[559533,11,559,533]
[559663,11,559,663]
[559665,11,559,665]
[559715,11,559,715]
[559775,11,559,775]
[209348,12,209,348]
[209433,12,209,433]
[209759,12,209,759]
[559203,13,559,203]
[559297,13,559,297]
[559298,13,559,298]
[559299,13,559,299]
[559314,13,559,314]
[559321,13,559,321]
[559322,13,559,322]
[559323,13,559,323]
[559324,13,559,324]
[559325,13,559,325]
[559326,13,559,326]
[559327,13,559,327]
[559387,13,559,387]
[559392,13,559,392]
[559472,13,559,472]
[559545,13,559,545]
[559575,13,559,575]
[559578,13,559,578]
[559593,13,559,593]
[559603,13,559,603]
[559712,13,559,712]
[559765,13,559,765]
[559770,13,559,770]
[559797,13,559,797]
[559826,13,559,826]
[559862,13,559,862]
[559900,13,559,900]
[559940,13,559,940]
[559295,14,559,295]
[559404,14,559,404]
[559504,14,559,504]
[559605,14,559,605]
[559821,14,559,821]
[559934,14,559,934]
[559935,14,559,935]
[559961,14,559,961]
[559200,15,559,200]
[559580,15,559,580]
[559641,15,559,641]
[559642,15,559,642]
[559658,15,559,658]
[559676,15,559,676]
[559683,15,559,683]
[559692,15,559,692]
[559760,15,559,760]
[209785,16,209,785]
[559762,17,559,762]
[559780,17,559,780]
[559992,17,559,992]
[209266,18,209,266]
[209317,18,209,317]
[209434,18,209,434]
[209682,18,209,682]
[209878,18,209,878]
[209690,19,209,690]
[209801,19,209,801]
[209837,19,209,837]
[209856,19,209,856]
[559258,20,559,258]
[559405,20,559,405]
[559521,20,559,521]
[559888,20,559,888]
[559943,20,559,943]
[559315,21,559,315]
[559397,21,559,397]
[559406,21,559,406]
[559528,21,559,528]
[559590,21,559,590]
[559591,21,559,591]
[559595,21,559,595]
[559596,21,559,596]
[559606,21,559,606]
[559648,21,559,648]
[559725,21,559,725]
[209364,22,209,364]
[209387,22,209,387]
[209392,22,209,392]
[209435,22,209,435]
[559534,23,559,534]
[559235,24,559,235]
[559338,24,559,338]
[559340,24,559,340]
[209691,25,209,691]
[209701,25,209,701]
[209821,25,209,821]
[209838,25,209,838]
[209849,25,209,849]
[559592,26,559,592]
[559594,26,559,594]
[559671,26,559,671]
[559748,26,559,748]
[559838,26,559,838]
[209757,28,209,757]
[209886,28,209,886]
[559296,29,559,296]
[559407,29,559,407]
[559507,29,559,507]
[559607,29,559,607]
[559657,29,559,657]
[559659,29,559,659]
[559694,29,559,694]
[559933,29,559,933]
[559316,30,559,316]
[559344,30,559,344]
[559610,30,559,610]
[559653,30,559,653]
[559813,30,559,813]
[559834,30,559,834]
[209212,31,209,212]
[209218,31,209,218]
[209219,31,209,219]
[209220,31,209,220]
[209240,31,209,240]
[209246,31,209,246]
[209363,31,209,363]
[209731,31,209,731]
[209861,31,209,861]
[209873,31,209,873]
[209902,31,209,902]
[209903,31,209,903]
[209907,31,209,907]
[209908,31,209,908]
[209909,31,209,909]
[209967,31,209,967]
[209974,31,209,974]
[209976,31,209,976]
[209977,31,209,977]
[209978,31,209,978]
[209999,31,209,999]
[559208,31,559,208]
[559213,31,559,213]
[559215,31,559,215]
[559217,31,559,217]
[559221,31,559,221]
[559222,31,559,222]
[559224,31,559,224]
[559225,31,559,225]
[559226,31,559,226]
[559227,31,559,227]
[559228,31,559,228]
[559229,31,559,229]
[559230,31,559,230]
[559231,31,559,231]
[559233,31,559,233]
[559237,31,559,237]
[559240,31,559,240]
[559241,31,559,241]
[559243,31,559,243]
[559244,31,559,244]
[559246,31,559,246]
[559247,31,559,247]
[559248,31,559,248]
[559250,31,559,250]
[559251,31,559,251]
[559252,31,559,252]
[559253,31,559,253]
[559255,31,559,255]
[559256,31,559,256]
[559259,31,559,259]
[559260,31,559,260]
[559261,31,559,261]
[559262,31,559,262]
[559263,31,559,263]
[559264,31,559,264]
[559265,31,559,265]
[559266,31,559,266]
[559268,31,559,268]
[559269,31,559,269]
[559270,31,559,270]
[559271,31,559,271]
[559272,31,559,272]
[559273,31,559,273]
[559274,31,559,274]
[559275,31,559,275]
[559276,31,559,276]
[559277,31,559,277]
[559278,31,559,278]
[559279,31,559,279]
[559281,31,559,281]
[559283,31,559,283]
[559284,31,559,284]
[559285,31,559,285]
[559286,31,559,286]
[559287,31,559,287]
[559288,31,559,288]
[559289,31,559,289]
[559290,31,559,290]
[559291,31,559,291]
[559292,31,559,292]
[559294,31,559,294]
[559301,31,559,301]
[559304,31,559,304]
[559307,31,559,307]
[559312,31,559,312]
[559313,31,559,313]
[559317,31,559,317]
[559320,31,559,320]
[559341,31,559,341]
[559346,31,559,346]
[559347,31,559,347]
[559348,31,559,348]
[559349,31,559,349]
[559351,31,559,351]
[559352,31,559,352]
[559353,31,559,353]
[559354,31,559,354]
[559355,31,559,355]
[559360,31,559,360]
[559365,31,559,365]
[559367,31,559,367]
[559369,31,559,369]
[559374,31,559,374]
[559375,31,559,375]
[559385,31,559,385]
[559388,31,559,388]
[559389,31,559,389]
[559394,31,559,394]
[559396,31,559,396]
[559400,31,559,400]
[559408,31,559,408]
[559412,31,559,412]
[559417,31,559,417]
[559420,31,559,420]
[559421,31,559,421]
[559430,31,559,430]
[559431,31,559,431]
[559432,31,559,432]
[559433,31,559,433]
[559434,31,559,434]
[559435,31,559,435]
[559436,31,559,436]
[559437,31,559,437]
[559438,31,559,438]
[559439,31,559,439]
[559440,31,559,440]
[559441,31,559,441]
[559442,31,559,442]
[559443,31,559,443]
[559444,31,559,444]
[559445,31,559,445]
[559446,31,559,446]
[559447,31,559,447]
[559448,31,559,448]
[559449,31,559,449]
[559450,31,559,450]
[559451,31,559,451]
[559452,31,559,452]
[559453,31,559,453]
[559454,31,559,454]
[559455,31,559,455]
[559456,31,559,456]
[559457,31,559,457]
[559458,31,559,458]
[559459,31,559,459]
[559470,31,559,470]
[559473,31,559,473]
[559475,31,559,475]
[559476,31,559,476]
[559477,31,559,477]
[559478,31,559,478]
[559485,31,559,485]
[559486,31,559,486]
[559487,31,559,487]
[559488,31,559,488]
[559489,31,559,489]
[559490,31,559,490]
[559492,31,559,492]
[559493,31,559,493]
[559494,31,559,494]
[559495,31,559,495]
[559496,31,559,496]
[559497,31,559,497]
[559498,31,559,498]
[559499,31,559,499]
[559500,31,559,500]
[559512,31,559,512]
[559513,31,559,513]
[559515,31,559,515]
[559519,31,559,519]
[559538,31,559,538]
[559540,31,559,540]
[559541,31,559,541]
[559547,31,559,547]
[559548,31,559,548]
[559549,31,559,549]
[559554,31,559,554]
[559558,31,559,558]
[559570,31,559,570]
[559573,31,559,573]
[559577,31,559,577]
[559579,31,559,579]
[559600,31,559,600]
[559612,31,559,612]
[559614,31,559,614]
[559621,31,559,621]
[559647,31,559,647]
[559650,31,559,650]
[559652,31,559,652]
[559666,31,559,666]
[559668,31,559,668]
[559681,31,559,681]
[559691,31,559,691]
[559696,31,559,696]
[559699,31,559,699]
[559704,31,559,704]
[559708,31,559,708]
[559709,31,559,709]
[559720,31,559,720]
[559721,31,559,721]
[559722,31,559,722]
[559724,31,559,724]
[559727,31,559,727]
[559728,31,559,728]
[559753,31,559,753]
[559761,31,559,761]
[559764,31,559,764]
[559771,31,559,771]
[559773,31,559,773]
[559776,31,559,776]
[559777,31,559,777]
[559778,31,559,778]
[559779,31,559,779]
[559785,31,559,785]
[559790,31,559,790]
[559795,31,559,795]
[559800,31,559,800]
[559801,31,559,801]
[559803,31,559,803]
[559824,31,559,824]
[559825,31,559,825]
[559832,31,559,832]
[559835,31,559,835]
[559840,31,559,840]
[559844,31,559,844]
[559860,31,559,860]
{"$rows_left_out":19812}
{"sheet":"SAEX","index":3,"n_rows":6011,"n_cols":3,"rows_kept":6011,"hidden":true}
["RCC","SVC_AREA_RCC","ZONE_TOLL_LOCL_IND"]
[1,1,1]
[1,81,2]
[2,2,1]
[2,16,1]
[2,44,2]
[2,90,1]
[2,97,2]
[3,3,1]
[3,57,1]
[3,65,1]
[4,4,1]
[4,7,1]
[4,32,1]
[4,73,1]
[4,75,1]
[4,95,1]
[5,5,1]
[6,6,1]
[6,24,2]
[6,34,1]
[6,67,1]
[7,4,1]
[7,7,1]
[7,32,1]
[7,73,1]
[7,75,1]
[7,95,1]
[8,8,1]
[8,9,2]
[8,31,1]
[8,89,2]
[9,8,2]
[9,9,1]
[9,30,2]
[9,31,1]
[9,51,2]
[9,89,1]
[10,10,1]
[10,39,1]
[10,71,1]
[11,11,1]
[11,52,1]
[12,12,1]
[12,33,2]
[12,38,2]
[12,55,2]
[12,58,1]
[12,59,1]
[12,116,1]
[13,13,1]
[13,31,1]
[13,32,2]
[13,92,2]
[13,108,2]
[14,14,1]
[15,15,1]
[15,73,2]
[15,75,2]
[15,85,2]
[16,2,1]
[16,16,1]
[16,44,2]
[16,45,1]
[16,50,2]
[17,17,1]
[18,18,1]
[18,35,2]
[18,68,2]
[19,19,1]
[19,36,2]
[19,72,1]
[19,78,1]
[20,20,1]
[20,30,1]
[20,31,1]
[20,48,2]
[20,77,1]
[20,86,2]
[20,92,1]
[20,93,1]
[20,108,2]
[21,21,1]
[21,48,2]
[21,76,1]
[21,77,2]
[21,86,1]
[22,22,1]
[23,23,1]
[23,104,1]
[24,6,2]
[24,24,1]
[24,34,2]
[24,67,1]
[24,100,1]
[25,25,1]
[25,28,2]
[25,69,1]
[25,74,1]
[25,87,2]
[25,88,1]
[26,26,1]
[26,53,2]
[26,56,1]
[26,114,2]
[26,120,2]
[28,25,2]
[28,28,1]
[28,55,2]
[28,66,2]
[29,29,1]
[29,64,2]
[30,9,2]
[30,20,1]
[30,30,1]
[30,31,1]
[30,48,2]
[30,77,2]
[30,92,2]
[30,93,1]
[31,9,1]
[31,13,1]
[31,20,1]
[31,30,1]
[31,31,1]
[32,4,1]
[32,7,1]
[32,13,2]
[32,32,1]
[32,73,1]
[32,75,1]
[32,95,1]
[33,12,2]
[33,33,1]
[33,38,1]
[33,58,2]
[33,59,1]
[33,105,1]
[34,6,1]
[34,24,2]
[34,34,1]
[34,67,1]
[35,18,2]
[35,35,1]
[35,68,1]
[35,111,2]
[36,19,2]
[36,36,1]
[36,72,1]
[37,37,1]
[37,51,1]
[37,54,1]
[38,12,2]
[38,33,1]
[38,38,1]
[38,58,2]
[38,59,1]
[38,105,2]
[39,10,1]
[39,39,1]
[39,71,2]
[39,96,2]
[40,40,1]
[40,69,1]
[40,74,2]
[40,88,2]
[40,112,1]
[40,117,1]
[40,118,1]
[41,41,1]
[42,42,1]
[42,43,1]
[42,83,2]
[42,103,1]
[42,116,2]
[43,42,1]
[43,43,1]
[43,70,1]
[43,80,1]
[43,83,1]
[43,103,1]
[43,113,2]
[43,115,1]
[44,2,2]
[44,16,2]
[44,44,1]
[44,68,2]
[44,97,1]
[44,111,2]
[45,16,1]
[45,45,1]
[45,66,1]
[45,113,1]
[45,116,2]
[46,31,1]
[46,46,1]
[46,91,2]
[48,20,2]
[48,21,2]
[48,30,2]
[48,48,1]
[48,51,2]
[48,77,1]
[48,86,2]
[48,93,1]
[49,49,1]
[50,16,2]
[50,50,1]
[50,74,1]
[51,9,2]
[51,37,1]
[51,48,2]
[51,51,1]
[51,54,2]
[51,89,2]
[51,93,2]
[52,11,1]
[52,52,1]
[52,65,1]
[52,82,1]
[53,26,2]
[53,53,1]
[53,106,1]
[53,120,1]
[54,37,1]
[54,51,2]
[54,54,1]
[54,89,2]
[54,102,1]
[55,12,2]
[55,28,2]
[55,55,1]
[55,58,2]
[55,101,1]
[56,26,1]
[56,56,1]
[56,84,2]
[57,3,1]
[57,57,1]
[57,112,2]
[58,12,1]
[58,33,2]
[58,38,2]
[58,55,2]
[58,58,1]
[58,59,1]
[58,116,2]
[59,12,2]
[59,33,1]
[59,38,2]
[59,58,1]
[59,59,1]
[59,105,1]
[60,60,1]
[61,61,1]
[62,62,1]
[62,87,1]
[62,101,2]
[62,109,2]
[63,63,1]
[64,29,2]
[64,64,1]
[65,3,1]
[65,52,1]
[65,65,1]
[65,82,1]
[66,28,2]
[66,45,1]
[66,66,1]
[66,113,2]
[67,6,1]
[67,24,1]
[67,34,1]
[67,67,1]
[67,100,2]
[68,18,2]
[68,35,1]
[68,44,2]
[68,68,1]
[68,111,2]
[68,118,2]
[69,25,2]
[69,40,1]
[69,69,1]
[69,74,2]
[69,87,2]
[69,88,1]
[70,43,1]
[70,70,1]
[70,90,1]
[70,103,2]
[70,113,2]
[70,115,2]
[70,119,2]
[71,10,1]
[71,39,2]
[71,71,1]
[72,19,1]
[72,36,1]
[72,72,1]
[73,4,1]
[73,7,1]
[73,15,2]
[73,32,1]
[73,73,1]
[73,75,1]
[73,95,1]
[74,25,1]
[74,40,2]
[74,50,2]
[74,69,1]
[74,74,1]
[74,88,1]
[74,117,2]
[75,4,1]
[75,7,1]
[75,15,2]
[75,32,1]
[75,73,1]
[75,75,1]
[75,95,1]
[76,21,1]
[76,76,1]
[76,86,2]
[76,100,1]
[77,20,1]
[77,21,2]
[77,30,2]
[77,48,1]
[77,77,1]
[77,86,1]
[77,92,1]
[77,93,1]
[77,108,2]
[78,19,1]
[78,78,1]
[79,79,1]
[80,43,1]
[80,80,1]
[80,115,1]
[80,119,1]
[81,1,2]
[81,81,1]
[81,107,1]
[81,655,1]
[82,52,1]
[82,65,1]
[82,82,1]
[83,42,2]
[83,43,1]
[83,83,1]
[83,103,1]
[84,56,2]
[84,84,1]
[84,99,1]
[84,104,1]
[85,15,2]
[85,85,1]
[86,20,2]
[86,21,1]
[86,48,2]
[86,76,2]
[86,77,1]
[86,86,1]
[86,92,2]
[86,93,2]
[87,25,2]
[87,62,1]
[87,69,2]
[87,87,1]
[87,88,2]
[88,25,1]
[88,40,2]
[88,69,1]
[88,74,1]
[88,87,2]
[88,88,1]
[88,117,2]
[89,8,2]
[89,9,1]
[89,31,1]
[89,51,2]
[89,54,2]
[89,89,1]
[90,2,1]
[90,70,1]
[90,90,1]
[90,113,1]
[91,46,2]
[91,91,1]
[92,13,2]
[92,20,1]
[92,30,2]
[92,31,1]
[92,77,1]
[92,86,2]
[92,92,1]
[92,93,2]
[92,108,1]
[93,20,1]
{"$rows_left_out":5612}
{"sheet":"EXDA","index":4,"n_rows":822,"n_cols":3,"rows_kept":822,"hidden":true}
["RCC","EXCH_NM","DIST_AREA_NM"]
[1,"ALPAUGH"]
[2,"ANGELS CAMP"]
[3,"ATWATER"]
[4,"AUBERRY"]
[5,"AVENAL"]
[6,"BADGER"]
[7,"BIG CREEK"]
[8,"BURREL"]
[9,"CARUTHERS"]
[10,"CATHEYS VALLEY"]
[11,"CHOWCHILLA"]
[12,"CLEMENTS"]
[13,"CLOVIS"]
[14,"COALINGA"]
[15,"COARSEGOLD"]
[16,"COPPEROPOLIS"]
[17,"CORCORAN"]
[18,"COULTERVILLE"]
[19,"CROWS LANDING"]
[20,"DEL REY"]
[21,"DINUBA"]
[22,"DOS PALOS"]
[23,"DUCOR"]
[24,"DUNLAP"]
[25,"ESCALON"]
[26,"EXETER"]
[28,"FARMINGTON"]
[29,"FIREBAUGH"]
[30,"FOWLER"]
[31,"FRESNO"]
[32,"FRIANT"]
[33,"GALT"]
[34,"GRANT GROVE"]
[35,"GROVELAND"]
[36,"GUSTINE"]
[37,"HANFORD"]
[38,"HERALD"]
[39,"HORNITOS"]
[40,"HUGHSON"]
[41,"HURON"]
[42,"IONE"]
[43,"JACKSON"]
[44,"JAMESTOWN"]
[45,"JENNY LIND"]
[46,"KERMAN"]
[48,"KINGSBURG"]
[49,"KIRKWOOD MEADOWS"]
[50,"KNIGHTS FERRY"]
[51,"LATON"]
[52,"LE GRAND"]
[53,"LEMON COVE"]
[54,"LEMOORE"]
[55,"LINDEN"]
[56,"LINDSAY"]
[57,"LIVINGSTON"]
[58,"LOCKEFORD"]
[59,"LODI"]
[60,"LOS BANOS"]
[61,"MADERA"]
[62,"MANTECA"]
[63,"MARIPOSA"]
[64,"MENDOTA"]
[65,"MERCED"]
[66,"MILTON"]
[67,"MIRAMONTE-PINEHURST"]
[68,"MOCCASIN"]
[69,"MODESTO"]
[70,"MOKELUMNE HILL"]
[71,"MOUNT BULLION"]
[72,"NEWMAN"]
[73,"NORTH FORK"]
[74,"OAKDALE"]
[75,"O'NEALS"]
[76,"ORANGE COVE"]
[77,"PARLIER"]
[78,"PATTERSON"]
[79,"PINECREST"]
[80,"PIONEER"]
[81,"PIXLEY"]
[82,"PLANADA"]
[83,"PLYMOUTH"]
[84,"PORTERVILLE"]
[85,"RAYMOND"]
[86,"REEDLEY"]
[87,"RIPON"]
[88,"RIVERBANK"]
[89,"RIVERDALE"]
[90,"SAN ANDREAS"]
[91,"SAN JOAQUIN"]
[92,"SANGER"]
[93,"SELMA"]
[94,"SEQUOIA"]
[95,"SHAVER"]
[96,"SNELLING"]
[97,"SONORA","MAIN"]
[98,"SONORA","JUNO"]
[99,"SPRINGVILLE"]
[100,"SQUAW VALLEY"]
[101,"STOCKTON"]
[102,"STRATFORD"]
[103,"SUTTER CREEK"]
[104,"TERRA BELLA"]
[105,"THORNTON"]
[106,"THREE RIVERS"]
[107,"TIPTON"]
[108,"TIVY VALLEY"]
[109,"TRACY"]
[110,"TULARE"]
[111,"TUOLUMNE"]
[112,"TURLOCK"]
[113,"VALLEY SPRINGS"]
[114,"VISALIA"]
[115,"VOLCANO"]
[116,"WALLACE"]
[117,"WATERFORD","MAIN"]
[118,"WATERFORD","DON PEDRO"]
[119,"WEST POINT"]
[120,"WOODLAKE"]
[121,"YOSEMITE"]
[122,"APTOS"]
[123,"BEN LOMOND"]
[124,"BIG SUR"]
[125,"BOULDER CREEK"]
[126,"CAMPBELL"]
[127,"CARMEL"]
[128,"CARMEL VALLEY"]
[129,"CASTROVILLE"]
[130,"CHUALAR"]
[131,"FELTON"]
[132,"GILROY"]
[133,"GONZALES"]
[134,"GREENFIELD"]
[135,"HOLLISTER"]
[136,"IDRIA"]
[137,"KING CITY"]
[138,"LOS GATOS"]
[139,"MONTEREY"]
[140,"MORGAN HILL"]
[141,"PINNACLES"]
[142,"SALINAS"]
[143,"SAN ARDO"]
[144,"SAN JOSE","WEST"]
[145,"SAN JOSE","SOUTH"]
[146,"SAN JOSE","NORTH"]
[147,"SAN JUAN"]
[148,"SAN LUCAS"]
[149,"SAN MARTIN"]
[150,"SANTA CRUZ"]
[151,"SARATOGA"]
[152,"SOLEDAD"]
[153,"SUNNYVALE"]
[154,"TRES PINOS"]
[155,"WATSONVILLE"]
[156,"ANTIOCH"]
[157,"BELVEDERE"]
[158,"CONCORD"]
[159,"CORTE MADERA"]
[160,"CROCKETT"]
[161,"DANVILLE"]
[163,"EAST BAY","ALAMEDA"]
[164,"EAST BAY","BERKELEY"]
[165,"EAST BAY","FRUITVALE"]
[166,"EAST BAY","MAIN-PIEDMONT"]
[167,"EAST BAY","TRINIDAD"]
[168,"EAST CONTRA COSTA"]
[169,"FREMONT-NEWARK","OLIVER"]
[170,"FREMONT-NEWARK","MAIN"]
[171,"FREMONT-NEWARK","GREENLEAF"]
[172,"HALF MOON BAY"]
[173,"HAYWARD"]
[174,"IGNACIO"]
[175,"INVERNESS"]
[176,"LA HONDA"]
[177,"LAFAYETTE"]
[178,"LIVERMORE"]
[179,"LOS ALTOS"]
[180,"MARTINEZ"]
[181,"MILL VALLEY"]
[182,"MILLBRAE"]
[183,"MORAGA"]
[184,"MOSS BEACH"]
[185,"MOUNTAIN VIEW"]
[186,"NICASIO"]
[187,"NOVATO"]
[188,"ORINDA"]
[189,"PACIFICA"]
[191,"PALO ALTO"]
[192,"PESCADERO"]
[193,"GOSHUTE","NEVADA"]
[194,"PITTSBURG"]
[195,"PLEASANT VALLEY"]
[196,"PLEASANTON"]
[197,"POINT REYES"]
[198,"REDWOOD CITY"]
[199,"RICHMOND"]
[202,"SAN CARLOS-BELMONT"]
[203,"SAN FRANCISCO","CENTRAL"]
[204,"SAN FRANCISCO","MONTROSE-EVERGREEN"]
[205,"SAN FRANCISCO","JUNIPER"]
[206,"SAN MATEO"]
[207,"SAN RAFAEL"]
[208,"SAUSALITO"]
[209,"SOUTH SAN FRANCISCO"]
[210,"STINSON BEACH-BOLINAS"]
[211,"SUNOL"]
[212,"WALNUT CREEK"]
[213,"WOODSIDE"]
[215,"ANNAPOLIS"]
[216,"ARCATA"]
[217,"BENICIA"]
[218,"BLUE LAKE"]
[219,"BODEGA BAY"]
[220,"BOONVILLE"]
[221,"BRIDGEVILLE"]
[222,"CALISTOGA"]
[223,"CAZADERO"]
[224,"CLEARLAKE OAKS"]
[225,"CLOVERDALE"]
[226,"COBB MOUNTAIN"]
[227,"COVELO"]
[228,"CRESCENT CITY"]
[229,"ELK"]
[230,"EUREKA"]
[231,"FAIRFIELD-SUISUN"]
[232,"FERNDALE"]
[233,"FORESTVILLE"]
[234,"FORT BRAGG"]
[235,"FORTUNA"]
[236,"GARBERVILLE"]
[237,"GEYSERVILLE"]
[238,"GUALALA"]
[239,"GUERNEVILLE"]
[240,"HEALDSBURG"]
[241,"HOPLAND"]
[242,"HYDESVILLE"]
[243,"KELSEYVILLE"]
[244,"KENWOOD"]
[245,"KLAMATH"]
[246,"LAKE BERRYESSA"]
[247,"LAKEPORT"]
[248,"LAYTONVILLE"]
[249,"LEGGETT"]
[250,"LOLETA"]
[251,"LOWER LAKE"]
[252,"MAD RIVER"]
[253,"MENDOCINO"]
[254,"MIDDLETOWN"]
[255,"MIRANDA"]
[256,"MONTE RIO"]
[257,"NAPA"]
[258,"NICE"]
[259,"OCCIDENTAL"]
[260,"ORICK"]
[261,"PEPPERWOOD"]
[262,"PETALUMA","MAIN"]
[263,"PETALUMA","SWIFT"]
[264,"PETROLIA"]
[265,"PIERCY"]
[266,"POINT ARENA"]
[267,"POTTER VALLEY"]
[268,"RIO DELL"]
[269,"RIO VISTA"]
[270,"SANTA ROSA"]
[271,"SEBASTOPOL"]
[272,"SMITH RIVER"]
[273,"SONOMA"]
[274,"SAINT HELENA"]
[275,"TIMBER COVE","TIMBER COVE"]
[276,"TOMALES"]
[277,"TRINIDAD"]
[278,"UKIAH"]
[279,"UPPER LAKE"]
[280,"VACAVILLE"]
[281,"VALLEJO"]
[282,"VALLEY FORD"]
[283,"WEOTT"]
[284,"WHITETHORN"]
[285,"WILLITS"]
[286,"WINDSOR"]
[287,"YOUNTVILLE"]
[288,"ADIN"]
[289,"ALLEGHANY"]
[290,"ALPINE"]
[291,"ALTA"]
[292,"ALTURAS"]
[293,"ANDERSON"]
[294,"ARBUCKLE"]
[295,"AUBURN","MAIN"]
[296,"BANGOR"]
[297,"BIEBER"]
[298,"BIGGS"]
[299,"BLAIRSDEN"]
[300,"NORTH TAHOE","BROCKWAY"]
[301,"BURNEY"]
[302,"BUTTE CITY"]
[303,"CAMPTONVILLE"]
[304,"SANDY VALLEY"]
[305,"CEDARVILLE"]
[306,"CHALLENGE"]
[307,"CHESTER"]
[308,"CHICO"]
[309,"COLEVILLE"]
[310,"COLFAX","COLFAX"]
[311,"COLUSA"]
[312,"CORNING"]
[313,"COTTONWOOD"]
[314,"COURTLAND"]
[315,"DAVIS"]
[316,"DIXON"]
[317,"DORRIS"]
[318,"DOWNIEVILLE"]
[319,"DUNNIGAN"]
[320,"DUNSMUIR"]
[321,"KENNEDY MEADOWS"]
[322,"ELK CREEK"]
[323,"ELK GROVE"]
[325,"ESPARTO"]
[326,"ETNA"]
[327,"FAIR OAKS"]
[328,"FALL RIVER MILLS"]
[330,"FOLSOM"]
[331,"FORESTHILL"]
[333,"FORT JONES"]
[334,"FRENCH GULCH"]
[335,"GAZELLE"]
[336,"GEORGETOWN"]
[337,"GERBER"]
[338,"GRASS VALLEY","MAIN"]
[339,"GREENVILLE"]
[340,"GRENADA"]
[341,"GRIDLEY"]
[342,"GRIMES"]
[343,"GUINDA"]
[344,"HAMBURG"]
[345,"HAPPY CAMP"]
[346,"HAYFORK"]
[347,"HERLONG"]
[349,"HOMEWOOD"]
[350,"HOOPA"]
[351,"HORNBROOK"]
[352,"ISLETON"]
[353,"JANESVILLE"]
[354,"KEDDIE"]
[355,"KNIGHTS LANDING"]
[356,"LAKE ALMANOR"]
[357,"LEWISTON"]
[359,"LINCOLN"]
[360,"LIVE OAK"]
[361,"LOS MOLINOS"]
[362,"LOYALTON"]
[363,"MACDOEL"]
[364,"MARYSVILLE"]
[365,"MAXWELL"]
[366,"MCCLOUD"]
[367,"MEADOWVIEW"]
[368,"MERIDIAN"]
[369,"MICHIGAN BAR"]
[370,"MILLVILLE"]
[371,"MINERAL"]
[372,"MONTAGUE"]
[373,"MONTGOMERY CREEK"]
[374,"MOUNT SHASTA"]
[375,"NEVADA CITY"]
[376,"NEW PINE CREEK"]
[377,"NEWELL"]
[378,"NICOLAUS"]
[379,"NORTH SAN JUAN"]
[380,"NORTH YUBA"]
[381,"OAK KNOLL"]
[382,"OAK RUN"]
[383,"OLINDA"]
[384,"ORLAND"]
[385,"ORLEANS"]
[386,"OROVILLE"]
[387,"PARADISE"]
[388,"PASKENTA"]
[389,"PAYNES CREEK"]
[390,"PLACERVILLE","WEST"]
[391,"PLATINA"]
[392,"PLEASANT GROVE"]
[393,"PORTOLA"]
[394,"PRINCETON"]
[395,"QUINCY"]
[396,"RED BLUFF"]
[397,"REDDING"]
[398,"RICHVALE"]
[399,"RIO LINDA"]
[400,"ROBBINS"]
[401,"ROSEVILLE","MAIN"]
[402,"ROSEVILLE","CITRUS HEIGHTS"]
[403,"SACRAMENTO","MAIN"]
[404,"SACRAMENTO","NORTH"]
[405,"SHASTA LAKE"]
[406,"SHINGLE SPRINGS"]
[407,"SHINGLETOWN"]
[408,"SIERRAVILLE"]
[409,"SMARTSVILLE"]
[410,"SODA SPRINGS"]
[411,"SOMES BAR"]
{"$rows_left_out":422}